toile de fond
created: 2012-05-16T00:00:00+02:00
modified: 2014-10-20T11:50:02+02:00
status: 1
type: Concept
alternative label: décor de théâtre
alternative label: rideau de fond
broader: T69-4785
definition: Grande toile peinte occupant le fond de la scène après les dernières coulisses. Elle tient toute la hauteur de la scène et s'enroule sur un cylindre.
in scheme: T69
preferred label: backdrops @en-us