élément textile ou de garniture
created: 2012-05-16T00:00:00+02:00
modified: 2014-10-20T11:31:50+02:00
status: 1
type: Concept
broad match: cb11933606x
broad match: Textile
broad match: http://vocab.getty.edu/aat/300231565
broader: T69-6546
definition: Élément de tissu, de cuir, etc. sans fonction précise ou constituant le fragment d'un élément non identifié.
in scheme: T69
narrower: T69-4808
narrower: T69-4810
narrower: T69-4811
narrower: T69-4817
narrower: T69-4821
narrower: T69-4823