bande textile
created: 2012-05-16T00:00:00+02:00
modified: 2014-10-20T11:33:22+02:00
status: 1
type: Concept
alternative label: ruban
broader: T69-4807
definition: Tissu tissé en faible largeur (moins de 25 cm).
in scheme: T69