siège public
created: 2012-05-16T00:00:00+02:00
modified: 2014-10-15T16:54:18+02:00
status: 1
type: Concept
broad match: http://data.bnf.fr/ark:/12148/cb12011170b
broad match: http://vocab.getty.edu/aat/300165810
broader: T69-464
definition: Siège installé dans un lieu public : édifice, square, boulevard, jardin, etc.
in scheme: T69
narrower: T69-483