canevas
terme associe: T69-4891
created: 2012-05-16T00:00:00+02:00
modified: 2014-12-12T10:56:51+01:00
status: 1
type: Concept
broader: T69-4807
definition: Toile écrue en coton, en lin ou en chanvre, très claire et divisée en petits carreaux qui sert à réaliser la tapisserie à l'aiguille. Ne pas confondre avec la broderie à l'aiguille sur canevas.
in scheme: T69
preferred label: canvas @en-us
related: T69-4891