échantillon présenté
created: 2012-05-16T00:00:00+02:00
modified: 2014-12-12T10:55:17+01:00
status: 1
type: Concept
broader: T69-4807
definition: Papier, tissu, cuir (lé, bande ou morceau) ayant reçu une présentation à but commercial : regroupement en livret, découpure particulière des bords, surfilage.
in scheme: T69