pièce de broderie
terme associe: T69-4891
terme associe: T69-4895
created: 2012-05-16T00:00:00+02:00
modified: 2014-12-12T10:58:27+01:00
status: 1
type: Concept
alternative label: morceau de broderie
broad match: http://data.bnf.fr/ark:/12148/cb119400073
broader: T69-4807
definition: Pièce de tissu brodé dont la mise en œuvre est inconnue ou incompréhensible.
in scheme: T69
preferred label: embroidery (visual works) @en-us
related: T69-4891
related: T69-4895