pièce de tissu
terme associe: T69-4897
created: 2012-05-16T00:00:00+02:00
modified: 2014-12-12T11:02:53+01:00
status: 1
type: Concept
alternative label: morceau de tissu
alternative label: étoffe
broad match: cb11933606x
broader: T69-4807
definition: Pièce de tissu, de forme et de taille variables, dont la mise en œuvre est inconnue ou incompréhensible.
in scheme: T69
preferred label: cloth @en-us
related: T69-4897