sculpture
terme associe: T69-321
terme associe: T69-325
terme associe: T69-326
terme associe: T69-327
terme associe: T69-343
terme associe: T69-382
terme associe: T69-9447
terme associe: T69-9632
created: 2012-05-16T00:00:00+02:00
modified: 2014-10-17T16:09:17+02:00
status: 1
type: Concept
definition: Domaine de l'art concerné par la production de formes en ronde-bosse ou en relief au moyen de diverses techniques : taille, moulage, modelage, fonte, repoussé, etc. Ce terme désigne également l'œuvre ou l'objet résultant de ces techniques.
in scheme: T69
narrower: T69-4827
narrower: T69-4845
narrower: T69-4847
narrower: T69-4849
narrower: T69-4851
narrower: T69-4876
narrower: T69-7962
narrower: T69-7963
narrower: T69-7964
narrower: T69-7965
narrower: T69-7966
narrower: T69-7967
narrower: T69-7968
narrower: T69-9980
preferred label: sculpture (visual work) @en-us
related: T69-321
related: T69-325
related: T69-326
related: T69-327
related: T69-343
related: T69-382
related: T69-9447
related: T69-9632