buste
terme associe: T69-1715
terme associe: T69-4831
created: 2012-05-16T00:00:00+02:00
modified: 2014-12-03T17:30:28+01:00
status: 1
type: Concept
broader: T69-4827
definition: Représentation en ronde-bosse de la partie supérieure du corps humain incluant une ou plusieurs têtes, le cou, une portion variable des épaules, des bras, de la poitrine et de l'estomac.
in scheme: T69
preferred label: busts (figures) @en-us
related: T69-1715
related: T69-4831
scope note: Préciser dans le champ PDEN le type de buste : buste à l'antique, buste sur piédouche, buste à l'italienne, etc.