buste de procession
terme associe: T69-4829
created: 2012-05-16T00:00:00+02:00
modified: 2014-11-27T16:19:49+01:00
status: 1
type: Concept
broader: T69-1557
definition: Ronde-bosse de la partie supérieure du corps humain dont la fonction est cultuelle et qui accompagne une procession.
in scheme: T69
preferred label: processional busts @en-us
related: T69-4829