groupe sculpté de procession
terme associe: T69-4833
created: 2012-05-16T00:00:00+02:00
modified: 2014-11-28T12:40:07+01:00
status: 1
type: Concept
broad match: http://vocab.getty.edu/aat/300047090
broader: T69-1557
definition: Réunion d'au moins deux figures en ronde-bosse sur un même support, ayant une unité iconographique et dont la fonction est cultuelle (accompagnement d'une procession).
in scheme: T69
preferred label: processional sculptural groups @en-us
preferred label: gruppo scultoreo processionale @it
preferred label: grupo escultório processional @pt
related: T69-4833