tête
terme associe: T69-1738
terme associe: T69-1749
created: 2012-05-16T00:00:00+02:00
modified: 2014-12-04T10:55:36+01:00
status: 1
type: Concept
broader: T69-4825
definition: Représentation en ronde-bosse ou en relief de l'extrémité supérieure du corps humain ou de l'extrémité antérieure du corps de l'animal comprenant la tête et le cou.
in scheme: T69
preferred label: heads @en-us
related: T69-1738
related: T69-1749
scope note: La tête est en ronde-bosse ou en haut-relief : ne pas la confondre avec la tête plate ou le mascaron qui sont des faces et qui ne comprennent pas le cou.