bas-relief
created: 2012-05-16T00:00:00+02:00
modified: 2014-12-03T16:51:23+01:00
status: 1
type: Concept
alternative label: basse-taille
broader: T69-4851
definition: Relief dont les différentes formes en saillie représentent moins de la moitié du volume réel d'un corps ou d'un objet.
in scheme: T69
narrower: T69-4855
narrower: T69-4857
narrower: T69-4859
preferred label: bas-reliefs (sculpture) @en-us