demi-relief
created: 2012-05-16T00:00:00+02:00
modified: 2014-12-03T17:09:25+01:00
status: 1
type: Concept
alternative label: demi-bosse
broad match: http://data.bnf.fr/ark:/12148/cb119776281
broader: T69-4851
definition: Relief dont les formes en saillie représentent plus de la moitié du volume réel d'un corps ou d'un objet.
in scheme: T69
preferred label: mezzo rilievo @en-us