masque sculpté
created: 2012-05-16T00:00:00+02:00
modified: 2014-12-03T17:18:29+01:00
status: 1
type: Concept
alternative label: masque de théâtre
alternative label: masque funéraire
broader: T69-4851
definition: Représentation en bas, en demi ou en haut-relief de la partie antérieure de la tête ou visage.
in scheme: T69