relief gravé
created: 2012-05-16T00:00:00+02:00
modified: 2014-12-03T17:20:02+01:00
status: 1
type: Concept
broad match: http://data.bnf.fr/ark:/12148/cb119776281
broad match: Relief (sculpture)
broad match: http://vocab.getty.edu/aat/300047230
broader: T69-4851
definition: Relief dont les différences de profondeur sont à peine suggérées : un tracé en creux, y délimite les formes représentées sur une surface plane (plan d'épannelage d'une dalle, d'un parement, surface d'un vase, etc.).
in scheme: T69