peinture, arts graphiques et des média
created: 2012-05-16T00:00:00+02:00
modified: 2014-10-17T15:37:28+02:00
status: 1
type: Concept
definition: Création plastique et son support, en deux dimensions, constituée d’images fixes ou animées.
in scheme: T69
narrower: T69-4881
narrower: T69-4899
narrower: T69-4934
narrower: T69-7974
narrower: T69-7975
narrower: T69-7979