miniature
created: 2012-05-16T00:00:00+02:00
modified: 2014-12-03T16:33:58+01:00
status: 1
type: Concept
broader: T69-4889
definition: Tableau de petit format, représentant une figure, une scène ou un paysage à échelle très réduite et de façon très détaillée. Son support, souvent l'ivoire, est mince et il comporte un cadre spécifique.
in scheme: T69
preferred label: miniatures @en-us