borne
created: 2012-05-16T00:00:00+02:00
modified: 2015-02-24T11:12:46+01:00
status: 1
type: Concept
alternative label: borne de juridiction
alternative label: borne de propriété
alternative label: borne frontalière
alternative label: borne kilométrique
broader: T69-464
definition: Pierre ou autre marque signalant la limite d’une propriété, d’un territoire, indiquant les distances ou servant de repère.
in scheme: T69
narrower: T69-493
preferred label: markers (monuments) @en-us
scope note: Voir aussi le Thesaurus de la désignation des œuvres architecturales et des espaces aménagés.