tableau de broderie
terme associe: T69-4810
terme associe: T69-4817
created: 2012-05-16T00:00:00+02:00
modified: 2014-12-03T16:36:49+01:00
status: 1
type: Concept
alternative label: tableau-canevas
broader: T69-4889
definition: Œuvre constituée d'une pièce de tissu brodée, destinée à reproduire, dans le matériau et avec la technique qui lui sont propres, les effets du tableau de peinture.
in scheme: T69
related: T69-4810
related: T69-4817