instrument de musique
created: 2012-05-16T00:00:00+02:00
modified: 2014-10-10T11:18:29+02:00
status: 1
type: Concept
definition: Objet pouvant produire un son contrôlé par un musicien.
in scheme: T69
narrower: T69-4938
narrower: T69-4999
narrower: T69-5014
narrower: T69-5089
narrower: T69-5167
narrower: T69-5178
narrower: T69-5180
narrower: T69-8076
preferred label: musical instruments @en-us