idiophone
created: 2012-05-16T00:00:00+02:00
modified: 2014-10-10T13:12:42+02:00
status: 1
type: Concept
broader: T69-4936
definition: Instrument qui produit un son par lui-même, que ce soit par friction, pincement, percussion ou secouement.
in scheme: T69
narrower: T69-4939
narrower: T69-4967
narrower: T69-4987
narrower: T69-4992
narrower: T69-9899
preferred label: idiophones @en-us