idiophone à émission par percussion directe
created: 2012-05-16T00:00:00+02:00
modified: 2014-10-10T13:18:05+02:00
status: 1
type: Concept
broad match: Idiophone
broader: T69-4938
definition: Idiophone produisant un son lorsqu'il est frappé par l'intermédiaire d'un percuteur externe directement manipulé par le musicien.
in scheme: T69
narrower: T69-4940
narrower: T69-4942
narrower: T69-4943
narrower: T69-4944
narrower: T69-4950
narrower: T69-4952
narrower: T69-4953
narrower: T69-4954
narrower: T69-4956
narrower: T69-4959
narrower: T69-4961
narrower: T69-4963
narrower: T69-4965
preferred label: directly struck idiophones @en-us