jacquemart
terme associe: T69-475
terme associe: T69-5323
terme associe: T69-7967
terme associe: T69-9980
created: 2012-05-16T00:00:00+02:00
modified: 2014-12-15T12:35:25+01:00
status: 1
type: Concept
alternative label: jaquemart
broader: T69-4939
definition: Ensemble formé d'un ou plusieurs automates en métal ou bois sculpté muni(s) d'un marteau ; il(s) en frappe(nt) une cloche pour marquer les heures.
in scheme: T69
preferred label: jacks (clock and watch components) @en-us
related: T69-475
related: T69-5323
related: T69-7967
related: T69-9980