roue à clochettes
created: 2012-05-16T00:00:00+02:00
modified: 2014-12-15T12:38:13+01:00
status: 1
type: Concept
broad match: http://data.bnf.fr/ark:/12148/cb16687544c
broad match: http://vocab.getty.edu/aat/300041659
broader: T69-4939
definition: Instrument constitué d'une roue simple ou double, sur le pourtour de laquelle sont fixées des clochettes. Elle est actionnée au moyen d'une manivelle, d'un bâton ou d'une corde tendant un ressort, pour marquer certains moments importants d'un office. Elle est fixée au mur près d'un autel.
in scheme: T69
preferred label: wheel bells @en-us
preferred label: ruota di campanelli @it