idiophone à émission par percussion indirecte (secouement ou raclement)
created: 2012-05-16T00:00:00+02:00
modified: 2014-10-10T14:09:51+02:00
status: 1
type: Concept
broader: T69-4938
definition: Idiophone produisant un son lorsqu'un mouvement lui est appliqué, mouvement actionnant des percuteurs internes ou externes qui viennent frapper le corps de l'instrument.
in scheme: T69
narrower: T69-4968
narrower: T69-4972
narrower: T69-4974
narrower: T69-4976
narrower: T69-4978
narrower: T69-4980
narrower: T69-4982
narrower: T69-4984
narrower: T69-4986
preferred label: indirectly struck idiophones @en-us