cadre à grelots
terme associe: T69-5001
created: 2012-05-16T00:00:00+02:00
modified: 2014-09-05T12:48:09+02:00
status: 1
type: Concept
alternative label: cadre à sonnailles
alternative label: sonnailles sur cadre
broad match: http://data.bnf.fr/ark:/12148/cb166877129
broader: T69-4967
definition: Instrument formé d'un cadre en bois auquel est accroché un ensemble de grelots ou de sonnailles.
in scheme: T69
preferred label: frame rattles @en-us
related: T69-5001