claquoir
created: 2012-05-16T00:00:00+02:00
modified: 2014-12-15T12:44:46+01:00
status: 1
type: Concept
broad match: http://data.bnf.fr/ark:/12148/cb166877129
broader: T69-4967
definition: Instrument ordinairement composé d'au moins deux éléments solidaires frappant l'un contre l'autre ; l'un des éléments est souvent en forme de heurtoir ou de poignée de métal. Lors des cérémonies religieuses, il sert à donner un signal aux fidèles, généralement pour les avertir d'avoir à se lever.
in scheme: T69
preferred label: clappers (idiophones) @en-us
preferred label: tabella @it