grelot
terme associe: T69-5001
created: 2012-05-16T00:00:00+02:00
modified: 2014-12-15T12:45:41+01:00
status: 1
type: Concept
broader: T69-4967
definition: Petite coque creuse et trouée, en métal, renfermant une bille mobile de plomb. Le grelot est de taille diverse, utilisé seul ou en grelotière, accroché par un lien au cou d'un animal, à un bras ou une cheville de danseur ou encore à un instrument de musique.
in scheme: T69
preferred label: pellet bells @en-us
related: T69-5001