hochet (idiophone)
created: 2012-05-16T00:00:00+02:00
modified: 2014-12-15T12:46:31+01:00
status: 1
type: Concept
alternative label: maraca
broader: T69-4967
definition: Instrument constitué de petits objets durs enfermés dans une coque rigide de forme et de matériau variés et qui se heurtent lorsqu'on les secoue.
in scheme: T69
preferred label: rattles @en-us