marteau à musique
terme associe: T69-4988
created: 2012-05-16T00:00:00+02:00
modified: 2014-09-05T14:16:08+02:00
status: 1
type: Concept
alternative label: martelet
alternative label: toque-maillet
broad match: http://data.bnf.fr/ark:/12148/cb166877129
broad match: http://vocab.getty.edu/aat/300041660
broader: T69-4967
definition: Instrument, utilisé lors des offices des Ténèbres, en bois, dans lequel un petit marteau articulé frappe alternativement selon le mouvement de balancier imprimé à l'objet, l'une ou l'autre des surfaces d'une planche arrondie.
in scheme: T69
related: T69-4988