sistre
created: 2012-05-16T00:00:00+02:00
modified: 2014-10-10T14:27:03+02:00
status: 1
type: Concept
alternative label: crepitaculum
broader: T69-4967
definition: Sorte de hochet, souvent en métal, en forme de U inversé avec une poignée verticale et des triangles horizontales, placées entre les deux branches du U qui s'entrechoquent lorsqu'on les secoue ; les barres portent parfois des anneaux mobiles ou des sonnailles.
in scheme: T69
preferred label: sistra @en-us