guimbarde
created: 2012-05-16T00:00:00+02:00
modified: 2014-10-10T14:32:31+02:00
status: 1
type: Concept
alternative label: trompe du Béarn
broader: T69-4992
definition: Instrument consistant en une languette, généralement en métal, placée dans un cadre que l'on tient au creux de la main ; la languette est mise en mouvement manuellement, la bouche du joueur sert de résonateur.
in scheme: T69
preferred label: Jew's harps @en-us