timbales
terme associe: T69-5183
created: 2012-05-16T00:00:00+02:00
modified: 2014-12-15T13:06:09+01:00
status: 1
type: Concept
alternative label: timbalons
broader: T69-4999
definition: Paire de cuvettes à peau tendue sur une caisse, le plus souvent, hémisphérique en cuivre ou en tôle. On en joue en frappant alternativement chaque tambour avec deux baguettes terminées par une petite boule recouverte de tissu.
in scheme: T69
preferred label: kettledrums @en-us
related: T69-5183
scope note: Le terme peut également désigner une paire de petits tambours de même forme, que l'on porte accrochés à la ceinture. Instrument militaire de la cavalerie.