rommelpot
created: 2012-05-16T00:00:00+02:00
modified: 2014-10-10T14:43:43+02:00
status: 1
type: Concept
alternative label: tambour à friction
broader: T69-4999
definition: Instrument constitué d'un pot en terre ou d'un cylindre de bois creux, avec une membrane en vessie animale tendue sur l'ouverture ; une baguette plantée dans le milieu de la membrane est actionnée par un mouvement circulaire et vertical.
in scheme: T69
preferred label: friction drums @en-us