mirliton
created: 2012-05-16T00:00:00+02:00
modified: 2014-10-10T14:41:34+02:00
status: 1
type: Concept
broader: T69-4999
definition: Instrument en forme de tuyau dont les extrémités sont fermées par une fine membrane de papier, de pelure d'oignon ou de peau ; une ouverture latérale est percée près de chaque extrémité et permet l'émission du son.
in scheme: T69
preferred label: kazoos @en-us