épinette
created: 2012-05-16T00:00:00+02:00
modified: 2014-12-15T11:56:18+01:00
status: 1
type: Concept
alternative label: virginal
broader: T69-5020
definition: Instrument à un seul clavier et à cordes pincées. Il peut être de forme rectangulaire, polygonale ou en aile d'oiseau. Le plan des cordes est horizontal, placé en oblique au clavier.
in scheme: T69
preferred label: spinets @en-us