piano
created: 2012-05-16T00:00:00+02:00
modified: 2014-12-15T11:58:05+01:00
status: 1
type: Concept
alternative label: piano droit
alternative label: piano quart de queue
alternative label: piano à demi-queue
alternative label: piano à queue
alternative label: pianoforte
alternative label: trapaud
broader: T69-5020
definition: Instrument à clavier unique et cordes frappées par des marteaux. Le plan des cordes est tantôt vertical (piano droit), tantôt horizontal et parallèle au clavier (piano carré), tantôt horizontal et perpendiculaire au clavier (piano à queue).
in scheme: T69
preferred label: pianos @en-us