cordophone composite
created: 2012-05-16T00:00:00+02:00
modified: 2014-10-10T12:33:25+02:00
status: 1
type: Concept
broad match: cb11981325x
broad match: Instrument à cordes
broad match: http://vocab.getty.edu/aat/300041641
broader: T69-5014
definition: Instrument dont les cordes sont tendues entre le résonateur d'un côté et un support de l'autre. Le plan des cordes peut être parallèle (famille générique des luths) ou perpendiculaire (famille générique des harpes) à la table d'harmonie.
in scheme: T69
narrower: T69-5043
narrower: T69-5065
narrower: T69-5085