viole
created: 2012-05-16T00:00:00+02:00
modified: 2014-12-15T11:30:07+01:00
status: 1
type: Concept
alternative label: bardone
alternative label: baryton à cordes
alternative label: pardessus de viole
alternative label: quinton
alternative label: ténor de viole
alternative label: viole d'amour
alternative label: viole de gambe
broader: T69-5043
definition: Instrument à caisse plate à épaules tombantes, ouïes en forme de C ou de flammes. Il possède en général six cordes, des frettes (barrettes) et une tête du chevillier sculptée. L'instrument est tenu entre les jambes. La viole d'amour est munie de cordes mélodiques frottées, et de cordes sympathiques ; ces dernières passent en dessous des premières et sous le chevalet et vibrent sans qu'on ne les touchent par "sympathie".
in scheme: T69
narrow match: Viole de gambe
preferred label: viols @en-us