violon
created: 2012-05-16T00:00:00+02:00
modified: 2014-12-15T11:32:41+01:00
status: 1
type: Concept
alternative label: alto
alternative label: violon ténor
broader: T69-5043
definition: Instrument à quatre cordes, caisse plate et épaules arrondies, avec des ouïes en F, un chevillier à volute et un manche sans frettes. L'alto est plus grand et plus grave que le violon.
in scheme: T69
preferred label: violins @en-us