cordophone composite à manche et cordes pincées
created: 2012-05-16T00:00:00+02:00
modified: 2014-10-10T12:47:10+02:00
status: 1
type: Concept
alternative label: archiluth
alternative label: bissex
alternative label: théorbe
broader: T69-5042
definition: Instrument constitué d'une caisse de résonance et d'un manche. Les cordes, tendues parallèlement à ce dernier sont, le plus souvent, pincées.
in scheme: T69
narrower: T69-5067
narrower: T69-5069
narrower: T69-5071
narrower: T69-5077
narrower: T69-5079
narrower: T69-5081
preferred label: lutelike chordophones : plucked @en-us