cistre
created: 2012-05-16T00:00:00+02:00
modified: 2014-10-10T12:48:52+02:00
status: 1
type: Concept
alternative label: archicistre
broader: T69-5065
definition: Sorte de luth à long manche fretté sur caisse arrondie à fond plat. On en joue avec un plectre.
in scheme: T69
preferred label: citterns @en-us