guitare-lyre
created: 2012-05-16T00:00:00+02:00
modified: 2014-10-10T12:52:26+02:00
status: 1
type: Concept
alternative label: lyre guitare
broad match: cb11938184j
broader: T69-5071
definition: Guitare dont le manche est encadré de deux bras incurvés et dont la forme générale rappelle celle de la lyre.
in scheme: T69
preferred label: lyre-guitars @en-us