guitare électrique
created: 2012-05-16T00:00:00+02:00
modified: 2014-12-15T11:39:54+01:00
status: 1
type: Concept
alternative label: guitare basse
broader: T69-5071
definition: Guitare sans caisse de résonance, dont le son est amplifié électriquement.
in scheme: T69
preferred label: electric guitars @en-us