luth
created: 2012-05-16T00:00:00+02:00
modified: 2014-12-15T11:43:59+01:00
status: 1
type: Concept
broader: T69-5065
definition: Instrument constitué d'une caisse bombée faite de côtes séparées et d'un manche fretté dont le chevillier est presque à angle droit. Les cordes sont doubles (mais il y a toujours une corde aiguë simple, chanterelle). La rose offre le plus souvent un décor mauresque.
in scheme: T69
preferred label: lutes (chordophones) @en-us