mandore
created: 2012-05-16T00:00:00+02:00
modified: 2014-10-10T12:56:26+02:00
status: 1
type: Concept
broader: T69-5065
definition: Instrument, ancêtre de la mandoline, à cordes doubles, composé d'une petite caisse bombée et d'un manche, en général fretté. Le son en est plus aigu que celui du luth.
in scheme: T69
preferred label: mandores @en-us