harpe
created: 2012-05-16T00:00:00+02:00
modified: 2014-12-15T11:49:34+01:00
status: 1
type: Concept
alternative label: harpe arquée
alternative label: harpe ditale
alternative label: harpe portative
alternative label: harpe triangulaire
broader: T69-5042
definition: Terme générique désignant un groupe d'instruments dans lesquels le plan des cordes est perpendiculaire à celui de la caisse de résonance. De forme triangulaire, la harpe est constituée d'une caisse de résonance, d'une console (élément qui reçoit les chevilles et le mécanisme) et de cordes. Le plus souvent, la harpe est fermée par un quatrième élément : une colonne reliant la console au bas de la caisse de résonance.
in scheme: T69
narrower: T69-5087
narrower: T69-9882
preferred label: harps (chordophones) @en-us