harpe à pédales
created: 2012-05-16T00:00:00+02:00
modified: 2014-10-10T12:58:32+02:00
status: 1
type: Concept
broad match: cb16682203r
broader: T69-5085
definition: Instrument disposant d'un mécanisme (placé dans la console), à crochets ou fourchettes, reliant les pédales aux cordes, qui agit sur celles-ci pour en modifier la longueur et jouer ainsi des altérations. Les sept pédales peuvent être à simple mouvement (une seule position) ou à double mouvement (trois positions).
in scheme: T69
preferred label: pedal harps @en-us